{"text_format":"1","workbook":"xlsx","n_sheets":13,"sheets":["Intro","Population","Fxfind","Fxtreat","Fxexpect","Fxprevent","Fxbenefits","Benefits","Output","Data","References","Benefits detail","Updates"],"not_rendered":{"charts":0,"images":2,"macros":1,"external_links":0,"defined_names":22,"comments":0,"pivot_tables":0},"unopened":[],"bounds":{"document_bytes":16777216,"sheet_cells":100000,"rows_first":2000,"rows_last":500,"rows_between":2000,"halvings":0,"cell_chars":16384,"cell_head_chars":4096},"cells_cut":0,"cells_raw":0,"read":"whole","date_system":"1900"}

{"sheet":"Intro","index":0,"n_rows":152,"n_cols":5,"rows_kept":152,"cut":false,"hidden":false,"merged":[]}
["Vertebral Fracture Benefits Calculator"]
["Introduction and instructions"]
[]
[]
[]
[]
[]
[]
[]
[]
[]
[]
[]
[]
[]
[]
[]
[]
[]
[]
[]
[]
[]
[]
[]
[]
[]
[]
[]
[]
{"$rows_left_out":123}
{"sheet":"Population","index":1,"n_rows":71,"n_cols":32,"rows_kept":71,"cut":false,"hidden":false,"merged":[[44,2,44,3],[45,2,45,3],[46,2,46,3],[47,2,47,3],[36,2,36,3],[43,2,43,3],[35,2,35,3],[11,1,13,10],[23,6,25,7],[17,3,17,4],[32,4,32,5],[32,6,32,7],[38,6,42,7],[37,2,37,3],[38,2,38,3],[39,2,39,3],[40,2,40,3],[41,2,41,3],[42,2,42,3]]}
[{"$f":"+Intro!A1","v":"Vertebral Fracture Benefits Calculator"}]
["Estimate vertebral factures in your population"]
[]
[]
[]
[]
[]
[]
[]
[]
[]
[]
[]
[]
[null,null,"Select country of interest"]
[]
[]
[null,null,"Selected Country","England",null,"Select your country of interest from the drop down list"]
[null,null,null,{"$f":"VLOOKUP(D18,Data!B6:C9,2,FALSE)","v":"CCGandorSTP"},{"$f":"D19&\"_pop\"","v":"CCGandorSTP_pop"}]
[]
[null,null,"Select population cohort for analysis (by age/gender)"]
[]
[null,null,null,null,"Male","Female"]
[null,null,"Include within analysis?",null,"Yes","Yes","Population can be refined by selecting one or both genders and an age range for each",null,null,null,null,null,"Row Numbers","Male","Female"]
[null,null,"Age from",null,"50 - 54","50 - 54",null,null,null,null,null,null,"From",{"$f":"IF(ISNA(HLOOKUP(E25,Data!I$96:Z$97,2,FALSE)),0,HLOOKUP(E25,Data!I$96:Z$97,2,FALSE))","v":11},{"$f":"IF(ISNA(HLOOKUP(F25,Data!J$96:AA$97,2,FALSE)),0,HLOOKUP(F25,Data!J$96:AA$97,2,FALSE))","v":11}]
[null,null,"Age to",null,"85 +","85 +",null,null,null,null,null,null,"To",{"$f":"IF(ISNA(HLOOKUP(E26,Data!I$96:Z$97,2,FALSE)),0,HLOOKUP(E26,Data!I$96:Z$97,2,FALSE))","v":18},{"$f":"IF(ISNA(HLOOKUP(F26,Data!J$96:AA$97,2,FALSE)),0,HLOOKUP(F26,Data!J$96:AA$97,2,FALSE))","v":18}]
[]
[]
[]
[null,null,"Specify population for inclusion",null,null,null,null,null,null,null,null,null,null,null,null,null,null,null,null,null,null,"Population growth in each year for each Organisation"]
{"$rows_left_out":42}
{"sheet":"Fxfind","index":2,"n_rows":43,"n_cols":18,"rows_kept":43,"cut":false,"hidden":false,"merged":[[38,9,42,10],[38,5,42,6],[36,3,36,5],[18,8,20,9],[26,8,26,9],[31,7,31,9]]}
[{"$f":"+Intro!A1","v":"Vertebral Fracture Benefits Calculator"}]
["Current and additional cases"]
[]
[]
[]
[]
[]
[]
[]
[]
[]
[]
[]
[]
[null,null,"Estimate of vertebral fractures in defined population"]
[]
[null,null,null,null,"Incidence in year",null,"Prevalence"]
[null,null,"Cases in year",{"$f":"+Population!D66","v":2021},{"$f":"+Population!E66","v":0},null,{"$f":"+Population!G66","v":0}]
[null,null,null,{"$f":"+Population!D67","v":2022},{"$f":"+Population!E67","v":0},null,{"$f":"+Population!G67","v":0},null,"Data for information only.  Not used to estimate benefits."]
[null,null,null,{"$f":"+Population!D68","v":2023},{"$f":"+Population!E68","v":0},null,{"$f":"+Population!G68","v":0}]
[null,null,null,{"$f":"+Population!D69","v":2024},{"$f":"+Population!E69","v":0},null,{"$f":"+Population!G69","v":0}]
[null,null,null,{"$f":"+Population!D70","v":2025},{"$f":"+Population!E70","v":0},null,{"$f":"+Population!G70","v":0}]
[]
[]
[null,null,"Enter the number of vertebral fractures seen in your service in one year"]
[]
[null,null,"Current cases found",null,null,"Enter number here",null,null,"Data for information only.  Not used to estimate benefits."]
[null,null,null,null,null,null,null,null,null,null,null,null,null,null,null,null,null," "]
[]
[null,null,"Enter the number of additional cases you expect to find"]
{"$rows_left_out":14}
{"sheet":"Fxtreat","index":3,"n_rows":96,"n_cols":25,"rows_kept":96,"cut":false,"hidden":false,"merged":[[32,11,45,12],[80,10,93,12],[43,2,43,4],[44,2,44,4],[45,2,45,4],[49,8,52,8],[49,9,52,9],[58,11,71,12],[47,6,52,6],[72,6,75,6]]}
[{"$f":"+Intro!A1","v":"Vertebral Fracture Benefits Calculator"}]
["Treatment selection and compliance for additional cases"]
[]
[]
[]
[]
[]
[]
[]
[]
[]
[]
[]
[]
[]
[]
[]
[]
[]
[null,null,"Specify the number of additional cases to go onto treatment"]
[]
[null,null,"Additional cases found",null,{"$f":"Fxfind!I39","v":0},"From previous step"]
[]
[null,null,"% of patients not treated",null,0.25,"Use data from local audit"]
[]
[null,null,"Number of additional cases treated",null,{"$f":"+E22*(1-E24)","v":0}]
[]
[]
[null,null,"Specify treatment options for additional cases"]
[]
{"$rows_left_out":67}
{"sheet":"Fxexpect","index":4,"n_rows":82,"n_cols":16,"rows_kept":82,"cut":false,"hidden":false,"merged":[]}
[{"$f":"+Intro!A1","v":"Vertebral Fracture Benefits Calculator"}]
["Secondary fractures expected for additional cases - with no treatment"]
[]
[]
[]
[]
[]
[]
[]
[]
[]
[]
[]
[null,null,"Risk of secondary fracture following a vertebral fracture"]
[]
[null,null,null,null,"Hip fracture (inpatient)","Other fracture site (inpatient)","Other fracture site (outpatient)","Clinical vertebral",8]
[null,null,"1st year post primary fracture ",null,{"$f":"+References!K120","v":3.7999999999999999E-2},{"$f":"+References!L120","v":1.2E-2},{"$f":"+References!M120","v":6.0000000000000001E-3},{"$f":"+References!N120","v":1.4E-2}]
[null,null,"2nd year post primary fracture ",null,{"$f":"+References!K121","v":2.1999999999999999E-2},{"$f":"+References!L121","v":4.0000000000000001E-3},{"$f":"+References!M121","v":0.01},{"$f":"+References!N121","v":3.2000000000000001E-2}]
[null,null,"3rd year post primary fracture ",null,{"$f":"+References!K122","v":0.04},{"$f":"+References!L122","v":6.0000000000000001E-3},{"$f":"+References!M122","v":1.6E-2},{"$f":"+References!N122","v":3.5999999999999997E-2}]
[null,null,"4th year post primary fracture ",null,{"$f":"+References!K123","v":0.02},{"$f":"+References!L123","v":6.0000000000000001E-3},{"$f":"+References!M123","v":8.0000000000000002E-3},{"$f":"+References!N123","v":1.7999999999999999E-2}]
[null,null,"5th year post primary fracture ",null,{"$f":"+References!K124","v":0.01},{"$f":"+References!L124","v":2E-3},{"$f":"+References!M124","v":0},{"$f":"+References!N124","v":8.0000000000000002E-3}]
[]
[null,null,"Number of patients in annual cohort",null,null,null,{"$f":"+Fxtreat!K48","v":0},"From sheet Fxtreat"]
[]
[]
[null,null,"Risk of secondary fracture by cohort in each year",null,null,null,null,null,null,null,"Number of secondary fractures by cohort in each year"]
[]
[null,null,null,"Year 1 cohort",null,null,null,null,null,null,{"$f":"+D28","v":"Year 1 cohort"}]
[null,null,null,"Year","Number in cohort","Hip fracture (inpatient)","Other fracture site (inpatient)","Other fracture site (outpatient)","Clinical vertebral",null,"Year","Number in cohort","Hip fracture (inpatient)","Other fracture site (inpatient)","Other fracture site (outpatient)","Clinical vertebral"]
[null,null,null,{"$f":"+Fxfind!C39","v":2021},{"$f":"+G23","v":0},{"$f":"+E17","v":3.7999999999999999E-2},1.2E-2,6.0000000000000001E-3,1.4E-2,null,{"$f":"+D30","v":2021},{"$f":"+E30","v":0},{"$f":"+$E$30*F30","v":0},{"$f":"+$E$30*G30","v":0},0,0]
{"$rows_left_out":53}
{"sheet":"Fxprevent","index":5,"n_rows":103,"n_cols":16,"rows_kept":103,"cut":false,"hidden":false,"merged":[[90,2,90,3]]}
[{"$f":"+Intro!A1","v":"Vertebral Fracture Benefits Calculator"}]
["Secondary fractures expected and prevented for additional cases under effective treatment"]
[]
[]
[]
[]
[]
[]
[]
[]
[]
[]
[]
[]
[]
[null,null,"Risk of secondary fracture following a vertebral fracture"]
[]
[null,null,null,null,"Hip fracture (inpatient)","Other fracture site (inpatient)","Other fracture site (outpatient)","Clinical vertebral",8]
[null,null,"1st year post primary fracture ",null,{"$f":"+References!K120","v":3.7999999999999999E-2},{"$f":"+References!L120","v":1.2E-2},{"$f":"+References!M120","v":6.0000000000000001E-3},{"$f":"+References!N120","v":1.4E-2}]
[null,null,"2nd year post primary fracture ",null,{"$f":"+References!K121","v":2.1999999999999999E-2},{"$f":"+References!L121","v":4.0000000000000001E-3},{"$f":"+References!M121","v":0.01},{"$f":"+References!N121","v":3.2000000000000001E-2}]
[null,null,"3rd year post primary fracture ",null,{"$f":"+References!K122","v":0.04},{"$f":"+References!L122","v":6.0000000000000001E-3},{"$f":"+References!M122","v":1.6E-2},{"$f":"+References!N122","v":3.5999999999999997E-2}]
[null,null,"4th year post primary fracture ",null,{"$f":"+References!K123","v":0.02},{"$f":"+References!L123","v":6.0000000000000001E-3},{"$f":"+References!M123","v":8.0000000000000002E-3},{"$f":"+References!N123","v":1.7999999999999999E-2}]
[null,null,"5th year post primary fracture ",null,{"$f":"+References!K124","v":0.01},{"$f":"+References!L124","v":2E-3},{"$f":"+References!M124","v":0},{"$f":"+References!N124","v":8.0000000000000002E-3}]
[]
[null,null,"Number of patients in annual cohort under effective treatment",null,null,null,{"$f":"+Fxtreat!K74","v":0},"From sheet Fxtreat"]
[]
[]
[]
[null,null,"Risk of secondary fracture by cohort in each year",null,null,null,null,null,null,null,"Number of secondary fractures by cohort in each year"]
[]
{"$rows_left_out":74}
{"sheet":"Fxbenefits","index":6,"n_rows":37,"n_cols":8,"rows_kept":37,"cut":false,"hidden":false,"merged":[[25,4,25,6]]}
[{"$f":"+Intro!A1","v":"Vertebral Fracture Benefits Calculator"}]
["Benefits of preventing a fracture"]
[]
[]
[]
[]
[]
[]
[]
[]
[]
[]
[]
[]
[null,null,"Estimated costs of treatment of secondary fragility fracture"]
[]
[null,null,"Estimated costs",9,"Hip fracture (inpatient)","Other fracture site (inpatient)","Other fracture site (outpatient)","Clinical vertebral"]
[null,null,"Acute care",null,{"$f":"ROUND(+'Benefits detail'!D7,0)","v":7843},{"$f":"ROUND(+'Benefits detail'!E7,0)","v":1768},{"$f":"ROUND(+'Benefits detail'!F7,0)","v":366},{"$f":"ROUND(+'Benefits detail'!G7,0)","v":1923}]
[null,null,"Community and primary care",null,{"$f":"ROUND(+'Benefits detail'!D8,0)","v":448},{"$f":"ROUND(+'Benefits detail'!E8,0)","v":57},{"$f":"ROUND(+'Benefits detail'!F8,0)","v":57},{"$f":"ROUND(+'Benefits detail'!G8,0)","v":59}]
[null,null,"Social care",null,{"$f":"ROUND(+'Benefits detail'!D9,0)","v":8237},{"$f":"ROUND(+'Benefits detail'!E9,0)","v":150},{"$f":"ROUND(+'Benefits detail'!F9,0)","v":150},{"$f":"ROUND(+'Benefits detail'!G9,0)","v":2908}]
[null,null,"All",null,{"$f":"ROUND(+'Benefits detail'!D10,0)","v":16528},{"$f":"ROUND(+'Benefits detail'!E10,0)","v":1975},{"$f":"ROUND(+'Benefits detail'!F10,0)","v":573},{"$f":"ROUND(+'Benefits detail'!G10,0)","v":4890}]
[]
[]
[null,null,"Apply Market Forces Factor (England only)"]
[]
[null,null,"Select Trust",10,"Base tariff",null,null,{"$f":"IF(OR(NOT(Population!D18=Data!B6),ISNA(VLOOKUP(E26,Data!C422:F654,4,FALSE))),1,VLOOKUP(E26,Data!C422:F654,4,FALSE))","v":1}]
[]
[null,null,null,null,"For Scotland, Wales and Northern Ireland ensure 'Base tariff' is selected."]
[]
[]
{"$rows_left_out":8}
{"sheet":"Benefits","index":7,"n_rows":48,"n_cols":9,"rows_kept":48,"cut":false,"hidden":false,"merged":[]}
[{"$f":"+Intro!A1","v":"Vertebral Fracture Benefits Calculator"}]
["Benefits of preventing secondary fragility fractures"]
[]
[]
[]
[]
[]
[]
[]
[]
[null,null,"Acute care"]
[null,null,"Year","Hip fracture (inpatient)","Other fracture site (inpatient)","Other fracture site (outpatient)","Clinical vertebral",null,"Total"]
[null,null,{"$f":"+Fxprevent!C98","v":2021},{"$f":"+Fxprevent!E98*Fxbenefits!E$34","v":0},{"$f":"+Fxprevent!F98*Fxbenefits!F$34","v":0},{"$f":"+Fxprevent!G98*Fxbenefits!G$34","v":0},{"$f":"+Fxprevent!H98*Fxbenefits!H$34","v":0},{"$f":"+Fxprevent!I98*Fxbenefits!I$34","v":0},{"$f":"SUM(D13:G13)","v":0}]
[null,null,{"$f":"+Fxprevent!C99","v":2022},{"$f":"+Fxprevent!E99*Fxbenefits!E$34","v":0},{"$f":"+Fxprevent!F99*Fxbenefits!F$34","v":0},{"$f":"+Fxprevent!G99*Fxbenefits!G$34","v":0},{"$f":"+Fxprevent!H99*Fxbenefits!H$34","v":0},null,0]
[null,null,{"$f":"+Fxprevent!C100","v":2023},{"$f":"+Fxprevent!E100*Fxbenefits!E$34","v":0},{"$f":"+Fxprevent!F100*Fxbenefits!F$34","v":0},{"$f":"+Fxprevent!G100*Fxbenefits!G$34","v":0},{"$f":"+Fxprevent!H100*Fxbenefits!H$34","v":0},null,0]
[null,null,{"$f":"+Fxprevent!C101","v":2024},{"$f":"+Fxprevent!E101*Fxbenefits!E$34","v":0},{"$f":"+Fxprevent!F101*Fxbenefits!F$34","v":0},{"$f":"+Fxprevent!G101*Fxbenefits!G$34","v":0},{"$f":"+Fxprevent!H101*Fxbenefits!H$34","v":0},null,0]
[null,null,{"$f":"+Fxprevent!C102","v":2025},{"$f":"+Fxprevent!E102*Fxbenefits!E$34","v":0},{"$f":"+Fxprevent!F102*Fxbenefits!F$34","v":0},{"$f":"+Fxprevent!G102*Fxbenefits!G$34","v":0},{"$f":"+Fxprevent!H102*Fxbenefits!H$34","v":0},null,0]
[null,null,{"$f":"(\"TOTAL - \"&C11)","v":"TOTAL - Acute care"},{"$f":"SUM(D13:D17)","v":0},{"$f":"SUM(E13:E17)","v":0},{"$f":"SUM(F13:F17)","v":0},{"$f":"SUM(G13:G17)","v":0},null,{"$f":"SUM(I13:I17)","v":0}]
[]
[]
[null,null,"Social care"]
[null,null,"Year",{"$f":"+D32","v":"Hip fracture (inpatient)"},{"$f":"+E32","v":"Other fracture site (inpatient)"},{"$f":"+F32","v":"Other fracture site (outpatient)"},{"$f":"+G32","v":"Clinical vertebral"},null,{"$f":"+I32","v":"Total"}]
[null,null,{"$f":"+C13","v":2021},{"$f":"+Fxprevent!E98*Fxbenefits!E$36","v":0},{"$f":"+Fxprevent!F98*Fxbenefits!F$36","v":0},{"$f":"+Fxprevent!G98*Fxbenefits!G$36","v":0},{"$f":"+Fxprevent!H98*Fxbenefits!H$36","v":0},null,{"$f":"SUM(D23:G23)","v":0}]
[null,null,{"$f":"+C14","v":2022},{"$f":"+Fxprevent!E99*Fxbenefits!E$36","v":0},{"$f":"+Fxprevent!F99*Fxbenefits!F$36","v":0},{"$f":"+Fxprevent!G99*Fxbenefits!G$36","v":0},{"$f":"+Fxprevent!H99*Fxbenefits!H$36","v":0},null,{"$f":"SUM(D24:G24)","v":0}]
[null,null,{"$f":"+C15","v":2023},{"$f":"+Fxprevent!E100*Fxbenefits!E$36","v":0},{"$f":"+Fxprevent!F100*Fxbenefits!F$36","v":0},{"$f":"+Fxprevent!G100*Fxbenefits!G$36","v":0},{"$f":"+Fxprevent!H100*Fxbenefits!H$36","v":0},null,0]
[null,null,{"$f":"+C16","v":2024},{"$f":"+Fxprevent!E101*Fxbenefits!E$36","v":0},{"$f":"+Fxprevent!F101*Fxbenefits!F$36","v":0},{"$f":"+Fxprevent!G101*Fxbenefits!G$36","v":0},{"$f":"+Fxprevent!H101*Fxbenefits!H$36","v":0},null,0]
[null,null,{"$f":"+C17","v":2025},{"$f":"+Fxprevent!E102*Fxbenefits!E$36","v":0},{"$f":"+Fxprevent!F102*Fxbenefits!F$36","v":0},{"$f":"+Fxprevent!G102*Fxbenefits!G$36","v":0},{"$f":"+Fxprevent!H102*Fxbenefits!H$36","v":0},null,0]
[null,null,{"$f":"(\"TOTAL - \"&C21)","v":"TOTAL - Social care"},{"$f":"SUM(D23:D27)","v":0},{"$f":"SUM(E23:E27)","v":0},{"$f":"SUM(F23:F27)","v":0},{"$f":"SUM(G23:G27)","v":0},null,{"$f":"SUM(I23:I27)","v":0}]
[]
[]
{"$rows_left_out":19}
{"sheet":"Output","index":8,"n_rows":150,"n_cols":16,"rows_kept":150,"cut":false,"hidden":false,"merged":[[26,12,26,17],[27,12,27,17],[30,12,30,17],[25,5,25,9],[26,5,26,9],[27,5,27,9],[28,5,28,9],[30,5,30,9],[25,12,25,17],[28,11,28,13],[28,14,28,17]]}
[{"$f":"+Intro!A1","v":"Vertebral Fracture Benefits Calculator"}]
["Output report"]
[]
[]
[]
[]
[]
[]
[]
[]
[]
[]
[]
[]
[]
[]
[]
[]
[]
[]
[]
[]
[]
[]
[null,null,"NHS contact",null,null,null,null,null,null,null,null,"Royal Osteoporosis Society / partner contact"]
[null,null,"Name of organisation ",null,null,null,null,null,null,null,null,"Contact name"]
[null,null,"Contact name",null,null,null,null,null,null,null,null,"Contact tel."]
[null,null,"Contact tel.",null,null,null,null,null,null,null,null,"Contact email"]
[null,null,"Contact email"]
[]
{"$rows_left_out":121}
{"sheet":"Data","index":9,"n_rows":678,"n_cols":71,"rows_kept":678,"cut":false,"hidden":false,"merged":[[2,4,8,11],[81,2,81,6],[80,2,80,6],[79,2,79,6]]}
[{"$f":"+Intro!A1","v":"Vertebral Fracture Benefits Calculator"}]
["Raw data and information sources used in this Calculator",null,null,null,null,null,null,null,null,null,null,null,null,"anystring"]
[null,null,null,null,"Please do not make changes to any cells on this sheet as this will affect the working of the model."]
[]
[null,"Countries"]
[null,"England",{"$f":"IF(ISBLANK(Population!E33),\"\",VLOOKUP(Population!E33,B11:C13,2,FALSE))","v":"CCGandorSTP"}]
[null,"Wales","WHB"]
[null,"Scotland","SHB"]
[null,"Northern Ireland","HST"]
[]
[null,"CCG","CCG"]
[null,"STP","STP"]
[null,"CCG and/or STP","CCGandorSTP"]
[]
[null,"Yes"]
[null,"No"]
[]
[null,"Enter total population for analysis"]
[null," OR CCG's/Healthboard's from the list below"]
[null,{"$f":"Data!B18&Data!B19","v":"Enter total population for analysis OR CCG's/Healthboard's from the list below"}]
[null,{"$f":"\"Select 1 or more \"&IF(Population!D18=Data!B6,Population!E33,VLOOKUP(Population!D18,Data!B6:C9,2,FALSE))&\"'s\"","v":"Select 1 or more CCG and/or STP's"}]
[]
[]
[null,"Incidence of Fractures"]
[null,"Data Source: ","Epidemiology and Economic Burden of Osteoporosis in UK (Svedbom 2013)",null,null,null,null,null,"Male","Male","Male","Male","Male","Male","Male","Male","Male","Male","Male","Male","Male","Male","Male","Male","Male","Male","Female","Female","Female","Female","Female","Female","Female","Female","Female","Female","Female","Female","Female","Female","Female","Female","Female","Female"]
[null,null,null,null,null,null,null,null,"0 - 4","5 - 9","10 - 14","15 - 19","20 - 24","25 - 29","30 - 34","35 - 39","40 - 44","45 - 49","50 - 54","55 - 59","60 - 64","65 - 69","70 - 74","75 - 79","80 - 84","85 +","0 - 4","5 - 9","10 - 14","15 - 19","20 - 24","25 - 29","30 - 34","35 - 39","40 - 44","45 - 49","50 - 54","55 - 59","60 - 64","65 - 69","70 - 74","75 - 79","80 - 84","85 +"]
[null,null,null,null,null,null,null,null,1,2,3,4,5,6,7,8,9,10,11,12,13,14,15,16,17,18,1,2,3,4,5,6,7,8,9,10,11,12,13,14,15,16,17,18]
[null,null,"Clinical vertebral",null,null,null,null,null,null,null,null,null,null,null,null,null,null,null,115,102,193,169,269,361,433,819,null,null,null,null,null,null,null,null,null,null,84,142,143,192,397,602,777,1061]
[null,null,"Incidence for fractures",null,100000]
[]
{"$rows_left_out":649}
{"sheet":"References","index":10,"n_rows":136,"n_cols":16,"rows_kept":136,"cut":false,"hidden":false,"merged":[[80,9,80,13],[99,15,99,17],[100,15,100,17],[101,15,101,17],[102,15,102,17],[55,6,55,7],[34,4,34,5],[56,3,56,5],[80,3,80,5],[80,6,80,7],[105,15,105,17],[107,15,107,17],[108,15,108,17],[109,15,109,17],[98,3,98,5],[103,10,103,16],[104,10,104,16]]}
[{"$f":"+Intro!A1","v":"Vertebral Fracture Benefits Calculator"}]
["References"]
[]
[]
[null,"Number",null,null,null,null,"Reference detail"]
[]
[null,1,"Population"]
[null,null,"CCG, STP, health board and other population data is shown on the sheet Data including information about data sources."]
[null,null,"England:","STP and CCG populations: Data/rows 90 - 335"]
[null,null,"Scotland:","Health board populations: Data/rows 339 - 360"]
[null,null,"N Ireland:","Health and social care board populations: Data rows 364 - 376"]
[null,null,"Wales:","Health board populations: Data/rows 380 - 416"]
[]
[]
[null,2,"Population growth"]
[null,null,"Population growth projections are shown on the sheet Data including information about data sources."]
[null,null,"England:","STP and CCG populations: Data/rows 90 - 335/columns AU - BQ"]
[null,null,"Scotland:","No data available"]
[null,null,"N Ireland:","No data available"]
[null,null,"Wales: ","Health board populations: Data/rows 380 - 416/columns AU - BQ"]
[]
[]
[null,3,"Incidence in year"]
[null,null,"Incidence is calculated for age bands selected and applied to the input population.  Parameters for 'Other site' in Calculator is calculated from 'forearm' and 'other' in source paper below."]
[null,null,"Source: ","Svedbom et al, Epidemiology and Economic Burden of Osteoporosis in UK, Archives of Osteoporosis, 2013 8:137, P212"]
[null,null,"For data see sheet Data/rows 56 - 60"]
[]
[]
[null,4,"Prevalence"]
[null,null,"Incidence is calculated for age bands selected and applied to the input population.  "]
{"$rows_left_out":107}
{"sheet":"Benefits detail","index":11,"n_rows":134,"n_cols":13,"rows_kept":134,"cut":false,"hidden":false,"merged":[[56,11,56,13],[48,11,48,13]]}
[{"$f":"+Intro!A1","v":"Vertebral Fracture Benefits Calculator"}]
["Benefits detail"]
[]
[null,"Used in benefits calculator"]
[]
[null,null,"Estimated costs","Hip fracture (inpatient)","Other fracture site (inpatient)","Other fracture site (outpatient)","Clinical vertebral"]
[null,null,"Acute care",{"$f":"+D42","v":7842.5948961243557},{"$f":"+F42","v":1767.9757761785386},{"$f":"+H42","v":366.07369095020408},{"$f":"+J42","v":1923.41}]
[null,null,"Community and primary care",{"$f":"+D53","v":447.69},{"$f":"+F53","v":57.254999999999995},{"$f":"+H53","v":57.254999999999995},{"$f":"+J53","v":58.604999999999997}]
[null,null,"Social care",{"$f":"+D60","v":8237.36},{"$f":"+F60","v":149.76},{"$f":"+H60","v":149.76},{"$f":"+J60","v":2907.84}]
[null,null,"All",{"$f":"SUM(D7:D9)","v":16527.644896124359},{"$f":"SUM(E7:E9)","v":1974.9907761785387},{"$f":"SUM(F7:F9)","v":573.08869095020407},{"$f":"SUM(G7:G9)","v":4889.8550000000005}]
[]
[]
[null,"Component costs",null,"Hip fracture (inpatient)",null,"Other fracture site (inpatient)",null,"Other fracture site (outpatient)",null,"Clinical vertebral"]
[null,null,null,null,"See reference",null,"See reference",null,"See reference",null,"See reference","Assumptions"]
[null,"Acute care"]
[]
[null,null,"A&E visits presentation of fracture"]
[null,null,"Unit cost of event",212,"B9",212,"B9",212,"B9",212,"B9","Assumes HRG is VB03Z"]
[null,null,"Rate of event (patients with previous fracture)",1,"Assumed",1,"Assumed",1,"Assumed",1,"Assumed","Assumes one A&E attendance for each fracture event"]
[null,null,"Sub-total",{"$f":"+D18*D19","v":212},null,{"$f":"+F18*F19","v":212},null,{"$f":"+H18*H19","v":212},null,{"$f":"+J18*J19","v":212}]
[]
[null,null,"Hospitalisation incl. excess bed days"]
[null,null,"Unit cost of event",7487.0588961243566,"B1",{"$f":"+K96","v":4123.2414271421603},"Table A",0,"NA",3846,"B1","Weighted average cost compared to matched controls"]
[null,null,"Rate of event (patients with previous fracture)",1,"B8",0.34,"B8",0,"NA",0.39900000000000002,"B8"]
[null,null,"Sub-total",{"$f":"+D23*D24","v":7487.0588961243566},null,{"$f":"+F23*F24","v":1401.9020852283345},null,{"$f":"+H23*H24","v":0},null,{"$f":"+J23*J24","v":1534.5540000000001}]
[]
[null,null,"A&E visits post fracture"]
[null,null,"Unit cost of event",92,"B1",{"$f":"+L96","v":84.278191451834829},"Table A",{"$f":"+L96","v":84.278191451834829},"Table A",84,"B1","Weighted average cost compared to matched controls"]
[null,null,"Rate of event (patients with previous fracture)",0.182,"B8",0.193,"B8",0.193,"B8",0.11600000000000001,"B8"]
[null,null,"Sub-total",{"$f":"+D28*D29","v":16.744},null,{"$f":"+F28*F29","v":16.265690950204121},null,{"$f":"+H28*H29","v":16.265690950204121},null,{"$f":"+J28*J29","v":9.7439999999999998}]
{"$rows_left_out":105}
{"sheet":"Updates","index":12,"n_rows":5,"n_cols":3,"rows_kept":5,"cut":false,"hidden":false,"merged":[]}
[{"$f":"+Intro!A1","v":"Vertebral Fracture Benefits Calculator"}]
["Updates and amendments - for information only"]
[]
[]
["Version","Date","Detail"]